Target
Androgen receptor
Ligand
BDBM309973
Substrate
Meas. Tech.
AR Antagonism
IC50
34.0±n/a nM
Citation
 Wohlfahrt, GTörmäkangas, OSalo, HHöglund, IKarjalainen, AKoivikko, PHolm, PRasku, SVesalainen, A Androgen receptor modulating compounds US Patent  US11046713 Publication Date 6/29/2021 
Target
Name:
Androgen receptor
Synonyms:
ANDR_HUMAN Androgen Receptor Androgen receptor/Baculoviral IAP repeat-containing protein 2 Dihydrotestosterone receptor Nuclear receptor subfamily 3 group C member 4
Type:
Receptor
Mol. Mass.:
99185.27
Organism:
Homo sapiens (Human)
Description:
CHO cells were stably transfected with human AR gene.
Residue:
920
  
Inhibitor
Name:
BDBM309973
Synonyms:
(S)-N-(1-(3-(4-cyano-3-methylphenyl)-1H-pyrazol-1-yl)propan-2-yl)-3-(furan-2-yl)-1H-pyrazole-5-carboxamide US9657003, 32
Type:
Small organic molecule
Emp. Form.:
C22H20N6O2
Mol. Mass.:
400.4332
SMILES:
C[C@@H](Cn1ccc(n1)-c1ccc(C#N)c(C)c1)NC(=O)c1cc(n[nH]1)-c1ccco1
: