Target
Androgen receptor
Ligand
BDBM309986
Substrate
Meas. Tech.
AR Antagonism
IC50
93.0±n/a nM
Citation
 Wohlfahrt, GTörmäkangas, OSalo, HHöglund, IKarjalainen, AKoivikko, PHolm, PRasku, SVesalainen, A Androgen receptor modulating compounds US Patent  US11046713 Publication Date 6/29/2021 
Target
Name:
Androgen receptor
Synonyms:
ANDR_HUMAN Androgen Receptor Androgen receptor/Baculoviral IAP repeat-containing protein 2 Dihydrotestosterone receptor Nuclear receptor subfamily 3 group C member 4
Type:
Receptor
Mol. Mass.:
99185.27
Organism:
Homo sapiens (Human)
Description:
CHO cells were stably transfected with human AR gene.
Residue:
920
  
Inhibitor
Name:
BDBM309986
Synonyms:
(R)-N-(1-(3-(3-chloro-4-cyanophenyl)-1H-pyrazol-1-yl)propan-2-yl)-2-morpholinothiazole-4-carboxamide US9657003, 132
Type:
Small organic molecule
Emp. Form.:
C21H21ClN6O2S
Mol. Mass.:
456.948
SMILES:
C[C@H](Cn1ccc(n1)-c1ccc(C#N)c(Cl)c1)NC(=O)c1csc(n1)N1CCOCC1
: