Target
Androgen receptor
Ligand
BDBM309993
Substrate
Meas. Tech.
AR Antagonism
IC50
128±n/a nM
Citation
 Wohlfahrt, GTörmäkangas, OSalo, HHöglund, IKarjalainen, AKoivikko, PHolm, PRasku, SVesalainen, A Androgen receptor modulating compounds US Patent  US11046713 Publication Date 6/29/2021 
Target
Name:
Androgen receptor
Synonyms:
ANDR_HUMAN Androgen Receptor Androgen receptor/Baculoviral IAP repeat-containing protein 2 Dihydrotestosterone receptor Nuclear receptor subfamily 3 group C member 4
Type:
Receptor
Mol. Mass.:
99185.27
Organism:
Homo sapiens (Human)
Description:
CHO cells were stably transfected with human AR gene.
Residue:
920
  
Inhibitor
Name:
BDBM309993
Synonyms:
(S)-N-(1-(3-(3-chloro-4-cyano-5-fluorophenyl)-1H-pyrazol-1-yl)propan-2-yl)imidazo[1,2-a]pyrimidine-2-carboxamide US9657003, 324
Type:
Small organic molecule
Emp. Form.:
C20H15ClFN7O
Mol. Mass.:
423.831
SMILES:
C[C@@H](Cn1ccc(n1)-c1cc(F)c(C#N)c(Cl)c1)NC(=O)c1cn2cccnc2n1
: