Target
Adenosine receptor A2a
Ligand
BDBM508528
Substrate
Meas. Tech.
competition binding assay
Ki
2.10±n/a nM
Citation
 Amjad, AGallo, GVHenderson, TJKuang, RLim, YLo, MMMetzger, Ede Lera Ruiz, MStamford, ATempest, PWhitehead, BWu, H 2,2-difluorodioxolo A2A receptor antagonists US Patent  US11046714 Publication Date 6/29/2021 
Target
Name:
Adenosine receptor A2a
Synonyms:
A2A adenosine receptor (hA2A) ADENOSINE A2 ADORA2 Adenosine A2A receptor (A2AAR)
Type:
G Protein-Coupled Receptor (GPCR)
Mol. Mass.:
44716.46
Organism:
Homo sapiens (Human)
Description:
P29274
Residue:
412
  
Inhibitor
Name:
BDBM508528
Synonyms:
2,2-difluoro-8-[2-(5-fluoro-1,3- dihydro-2H-isoindol-2- yl)ethyl][1,3]dioxolo[4,5- h][1,2,4]triazolo[1,5- c]quinazolin-5-amine | US11046714, Example 8
Type:
Small organic molecule
Emp. Form.:
C20H15F3N6O2
Mol. Mass.:
428.3673
SMILES:
Nc1nc2c3OC(F)(F)Oc3ccc2c2nc(CCN3Cc4ccc(F)cc4C3)nn12
: