Target
Adenosine receptor A2a
Ligand
BDBM508625
Substrate
Meas. Tech.
competition binding assay
Ki
1.20±n/a nM
Citation
 Amjad, AGallo, GVHenderson, TJKuang, RLim, YLo, MMMetzger, Ede Lera Ruiz, MStamford, ATempest, PWhitehead, BWu, H 2,2-difluorodioxolo A2A receptor antagonists US Patent  US11046714 Publication Date 6/29/2021 
Target
Name:
Adenosine receptor A2a
Synonyms:
A2A adenosine receptor (hA2A) ADENOSINE A2 ADORA2 Adenosine A2A receptor (A2AAR)
Type:
G Protein-Coupled Receptor (GPCR)
Mol. Mass.:
44716.46
Organism:
Homo sapiens (Human)
Description:
P29274
Residue:
412
  
Inhibitor
Name:
BDBM508625
Synonyms:
(R or S)-8-[2-(3,3-difluoro-2- methylpiperidin-1-yl)ethyl]-2,2- difluoro[1,3]dioxolo[4,5-h][1,2,4] triazolo[1,5-c]quinazolin-5-amine (faster eluting c) | US11046714, Example 68
Type:
Small organic molecule
Emp. Form.:
C18H18F4N6O2
Mol. Mass.:
426.3681
SMILES:
C[C@H]1N(CCc2nc3c4ccc5OC(F)(F)Oc5c4nc(N)n3n2)CCCC1(F)F
: