Target
Adenosine receptor A2a
Ligand
BDBM508681
Substrate
Meas. Tech.
competition binding assay
Ki
4.90±n/a nM
Citation
 Amjad, AGallo, GVHenderson, TJKuang, RLim, YLo, MMMetzger, Ede Lera Ruiz, MStamford, ATempest, PWhitehead, BWu, H 2,2-difluorodioxolo A2A receptor antagonists US Patent  US11046714 Publication Date 6/29/2021 
Target
Name:
Adenosine receptor A2a
Synonyms:
A2A adenosine receptor (hA2A) ADENOSINE A2 ADORA2 Adenosine A2A receptor (A2AAR)
Type:
G Protein-Coupled Receptor (GPCR)
Mol. Mass.:
44716.46
Organism:
Homo sapiens (Human)
Description:
P29274
Residue:
412
  
Inhibitor
Name:
BDBM508681
Synonyms:
2,2-difluoro-8-{[4-(4-fluorophenoxy) piperidin-1-yl]methyl}[1,3]dioxolo [4,5-h][1,2,4]triazolo[1,5-c]quinazolin- 5-amine | US11046714, Example 117
Type:
Small organic molecule
Emp. Form.:
C22H19F3N6O3
Mol. Mass.:
472.4199
SMILES:
Nc1nc2c3OC(F)(F)Oc3ccc2c2nc(CN3CCC(CC3)Oc3ccc(F)cc3)nn12
: