Target
Adenosine receptor A2a
Ligand
BDBM508688
Substrate
Meas. Tech.
competition binding assay
Ki
1.60±n/a nM
Citation
 Amjad, AGallo, GVHenderson, TJKuang, RLim, YLo, MMMetzger, Ede Lera Ruiz, MStamford, ATempest, PWhitehead, BWu, H 2,2-difluorodioxolo A2A receptor antagonists US Patent  US11046714 Publication Date 6/29/2021 
Target
Name:
Adenosine receptor A2a
Synonyms:
A2A adenosine receptor (hA2A) ADENOSINE A2 ADORA2 Adenosine A2A receptor (A2AAR)
Type:
G Protein-Coupled Receptor (GPCR)
Mol. Mass.:
44716.46
Organism:
Homo sapiens (Human)
Description:
P29274
Residue:
412
  
Inhibitor
Name:
BDBM508688
Synonyms:
2,2-difluoro-8-({[4-(trifluoromethyl) benzyl]amino}methyl)[1,3]dioxolo [4,5-h][1,2,4]triazolo[1,5-c]quinazolin- 5-amine | US11046714, Example 124
Type:
Small organic molecule
Emp. Form.:
C19H13F5N6O2
Mol. Mass.:
452.3375
SMILES:
Nc1nc2c3OC(F)(F)Oc3ccc2c2nc(CNCc3ccc(cc3)C(F)(F)F)nn12
: