Target
Galectin-1
Ligand
BDBM508738
Substrate
Meas. Tech.
fluorescence anisotropy assay
Kd
33.0±n/a nM
Citation
 Zetterberg, F Galactoside inhibitor of galectins US Patent  US11046725 Publication Date 6/29/2021 
Target
Name:
Galectin-1
Synonyms:
14 kDa lectin HPL LGALS1 Lectin galactoside-binding soluble 1 | Putative MAPK-activating protein PM12
Type:
beta galactoside-binding protein
Mol. Mass.:
14713.53
Organism:
Homo sapiens (Human)
Description:
P09382
Residue:
135
  
Inhibitor
Name:
BDBM508738
Synonyms:
5-Bromo-2-cyano-pyridine-3-yl 3-deoxy-3-[4-(2-hydroxythiazol-4-yl)-1H-1,2,3-triazol-1-yl]-1-thio-α-D-galactopyranoside | US11046725, Example 14
Type:
Small organic molecule
Emp. Form.:
C17H15BrN6O5S2
Mol. Mass.:
527.372
SMILES:
OCC1O[C@H](Sc2cc(Br)cnc2C#N)C(O)[C@H]([C@H]1O)n1cc(nn1)-c1csc(O)n1
: