Target
Galectin-3
Ligand
BDBM508751
Substrate
Meas. Tech.
fluorescence anisotropy assay
Kd
4600±n/a nM
Citation
 Zetterberg, F Galactoside inhibitor of galectins US Patent  US11046725 Publication Date 6/29/2021 
Target
Name:
Galectin-3
Synonyms:
LEG3_HUMAN MAC2
Type:
Enzyme
Mol. Mass.:
26156.54
Organism:
Homo sapiens (Human)
Description:
P17931
Residue:
250
  
Inhibitor
Name:
BDBM508751
Synonyms:
3,4-Dichloro-6-fluoro-phenyl 3-deoxy-3-[4-(2-hydroxythiazol-4-yl)-1H-1,2,3-triazol-1-yl]-1-thio-α-D-galactopyranoside | US11046725, Example 31
Type:
Small organic molecule
Emp. Form.:
C17H15Cl2FN4O5S2
Mol. Mass.:
509.359
SMILES:
OCC1O[C@H](Sc2cc(Cl)c(Cl)cc2F)C(O)[C@H]([C@H]1O)n1cc(nn1)-c1csc(O)n1
: