Target
Replicase polyprotein 1ab
Ligand
BDBM509817
Substrate
Meas. Tech.
Evaluation of Antiviral Activity of Compounds Against COVID-19 (nCoV-2019, SARS-CoV2) Mpro in the Enzymatic Assay
IC50
6000±n/a nM
Citation
 Arnold, LDJennings, AKeung, W Inhibitors of cysteine proteases and methods of use thereof US Patent  US11124497 Publication Date 9/21/2021 
Target
Name:
Replicase polyprotein 1ab
Synonyms:
ORF1ab polyprotein pp1ab | rep
Type:
Protein
Mol. Mass.:
754187.17
Organism:
HCoV-229E
Description:
P0C6X1
Residue:
6758
  
Inhibitor
Name:
BDBM509817
Synonyms:
US11124497, Compound 253 US11472793, Compound 253 | US11524940, Compound 253
Type:
Small organic molecule
Emp. Form.:
C24H27N5O4
Mol. Mass.:
449.5023
SMILES:
COc1cccc2[nH]c(cc12)C(=O)N[C@@H](CC(C)C)C(=O)N[C@@H](Cc1ccc[nH]c1=O)C#N
: