Target
Replicase polyprotein 1ab
Ligand
BDBM509851
Substrate
Meas. Tech.
Evaluation of Antiviral Activity of Compounds Against COVID-19 (nCoV-2019, SARS-CoV2) Mpro in the Enzymatic Assay
IC50
6000±n/a nM
Citation
 Arnold, LDJennings, AKeung, W Inhibitors of cysteine proteases and methods of use thereof US Patent  US11124497 Publication Date 9/21/2021 
Target
Name:
Replicase polyprotein 1ab
Synonyms:
ORF1ab polyprotein pp1ab | rep
Type:
Protein
Mol. Mass.:
754187.17
Organism:
HCoV-229E
Description:
P0C6X1
Residue:
6758
  
Inhibitor
Name:
BDBM509851
Synonyms:
US11124497, Compound 365 (Isomer 2) US11472793, Compound 365 (Isomer 2) | US11524940, Compound 365 (Isomer 2)
Type:
Small organic molecule
Emp. Form.:
C23H31ClN4O4
Mol. Mass.:
462.97
SMILES:
CC(C)C[C@H](NC(=O)C[C@](C)(O)c1ccc(Cl)cc1)C(=O)N[C@@H](C[C@@H]1CCNC1=O)C#N
: