Target
Replicase polyprotein 1ab
Ligand
BDBM509886
Substrate
Meas. Tech.
Evaluation of Antiviral Activity of Compounds Against COVID-19 (nCoV-2019, SARS-CoV2) Mpro in the Enzymatic Assay
IC50
6000±n/a nM
Citation
 Arnold, LDJennings, AKeung, W Inhibitors of cysteine proteases and methods of use thereof US Patent  US11124497 Publication Date 9/21/2021 
Target
Name:
Replicase polyprotein 1ab
Synonyms:
ORF1ab polyprotein pp1ab | rep
Type:
Protein
Mol. Mass.:
794070.71
Organism:
2019-nCoV
Description:
P0DTD1
Residue:
7096
  
Inhibitor
Name:
BDBM509886
Synonyms:
US11124497, Compound 467 (Isomer 1) US11472793, Compound 467 (Isomer 1) | US11524940, Compound 467 (Isomer 1)
Type:
Small organic molecule
Emp. Form.:
C20H24F3N5O3
Mol. Mass.:
439.4315
SMILES:
FC(F)(F)CNc1cccn([C@@H](CC2CC2)C(=O)N[C@@H](C[C@@H]2CCNC2=O)C#N)c1=O
: