Target
Replicase polyprotein 1ab
Ligand
BDBM509932
Substrate
Meas. Tech.
Evaluation of Antiviral Activity of Compounds Against COVID-19 (nCoV-2019, SARS-CoV2) Mpro in the Enzymatic Assay
IC50
6000±n/a nM
Citation
 Arnold, LDJennings, AKeung, W Inhibitors of cysteine proteases and methods of use thereof US Patent  US11124497 Publication Date 9/21/2021 
Target
Name:
Replicase polyprotein 1ab
Synonyms:
ORF1ab polyprotein pp1ab | rep
Type:
Protein
Mol. Mass.:
794070.71
Organism:
2019-nCoV
Description:
P0DTD1
Residue:
7096
  
Inhibitor
Name:
BDBM509932
Synonyms:
US11124497, Compound 535 US11472793, Compound 535 | US11524940, Compound 535
Type:
Small organic molecule
Emp. Form.:
C24H29N5O5
Mol. Mass.:
467.5176
SMILES:
CCO[C@@H]1C[C@H](N(C1)C(=O)c1cc2c(OC)cccc2[nH]1)C(=O)N[C@@H](C[C@@H]1CCNC1=O)C#N
: