Target
Replicase polyprotein 1ab
Ligand
BDBM509949
Substrate
Meas. Tech.
Evaluation of Antiviral Activity of Compounds Against COVID-19 (nCoV-2019, SARS-CoV2) Mpro in the Enzymatic Assay
IC50
6000±n/a nM
Citation
 Arnold, LDJennings, AKeung, W Inhibitors of cysteine proteases and methods of use thereof US Patent  US11124497 Publication Date 9/21/2021 
Target
Name:
Replicase polyprotein 1ab
Synonyms:
ORF1ab polyprotein pp1ab | rep
Type:
Protein
Mol. Mass.:
754187.17
Organism:
HCoV-229E
Description:
P0C6X1
Residue:
6758
  
Inhibitor
Name:
BDBM509949
Synonyms:
US11124497, Compound 649 US11472793, Compound 649 | US11524940, Compound 649
Type:
Small organic molecule
Emp. Form.:
C22H26F2N4O3
Mol. Mass.:
432.4636
SMILES:
Fc1cc(F)cc(CCC(=O)N[C@@H](CC2CC2)C(=O)N[C@@H](C[C@@H]2CCNC2=O)C#N)c1
: