Target
Cathepsin K
Ligand
BDBM429100
Substrate
Meas. Tech.
FRET-based enzymatic assay
IC50
180±n/a nM
Citation
 Ma, CXia, ZSacco, MDHu, YTownsend, JAMeng, XChoza, JTan, HJang, JGongora, MVZhang, XZhang, FXiang, YMarty, MTChen, YWang, J Discovery of Di- and Trihaloacetamides as Covalent SARS-CoV-2 Main Protease Inhibitors with High Target Specificity. J Am Chem Soc 143:20697-20709 (2021)  
Target
Name:
Cathepsin K
Synonyms:
CATK_HUMAN CTSO Cathepsin O Cathepsin X
Type:
Enzyme
Mol. Mass.:
36975.68
Organism:
Homo sapiens (Human)
Description:
P43235
Residue:
329
  
Inhibitor
Name:
BDBM429100
Synonyms:
MPI8 | jm5b01461, Compound 45
Type:
Small Organic Molecule
Emp. Form.:
C32H48N4O7
Mol. Mass.:
600.7461
SMILES:
CC(OC(C)(C)C)[C@H](NC(=O)OCc1ccccc1)C(=O)N[C@@H](CC1CCCCC1)C(=O)N[C@@H](C[C@@H]1CCNC1=O)C=O
: