Target
Replicase polyprotein 1ab
Ligand
BDBM509994
Substrate
Meas. Tech.
FRET-based enzymatic assay
IC50
>20000±n/a nM
Citation
 Ma, CXia, ZSacco, MDHu, YTownsend, JAMeng, XChoza, JTan, HJang, JGongora, MVZhang, XZhang, FXiang, YMarty, MTChen, YWang, J Discovery of Di- and Trihaloacetamides as Covalent SARS-CoV-2 Main Protease Inhibitors with High Target Specificity. J Am Chem Soc 143:20697-20709 (2021)  
Target
Name:
Replicase polyprotein 1ab
Synonyms:
ORF1ab polyprotein pp1ab | rep
Type:
Protein
Mol. Mass.:
794070.71
Organism:
2019-nCoV
Description:
P0DTD1
Residue:
7096
  
Inhibitor
Name:
BDBM509994
Synonyms:
Jun9-90-3S
Type:
Small organic molecule
Emp. Form.:
C29H24BrCl2N3O2
Mol. Mass.:
597.33
SMILES:
C[C@H](NC(=O)[C@@H](N(C(=O)C(Cl)Cl)c1ccc(cc1)-c1ccccc1)c1cccnc1)c1ccc(Br)cc1
: