Target
Replicase polyprotein 1ab
Ligand
BDBM510026
Substrate
Meas. Tech.
SARS-CoV-2 Coronavirus 3C Protease FRET Assay
IC50
306±n/a nM
Citation
 Kania, RSOwen, DRPettersson, MYSammons, MFTuttle, JB Compounds and method of treating covid-19 WIPO 0:0 (2021) Target
Name:
Replicase polyprotein 1ab
Synonyms:
ORF1ab polyprotein pp1ab | rep
Type:
Protein
Mol. Mass.:
794070.71
Organism:
2019-nCoV
Description:
P0DTD1
Residue:
7096
  
Inhibitor
Name:
BDBM510026
Synonyms:
(3S)-3-({N-[(4-methoxy-1H-indol-2-yl)carbonyl]-L-leucyl}amino)-2-oxo-4-[(3S)-2-oxopyrrolidin-3-yl]butyl 1 ,5-dimethyl-1 H-imidazole-4-carboxylate | WO2021205290, Example 40
Type:
Small organic molecule
Emp. Form.:
C30H38N6O7
Mol. Mass.:
594.6587
SMILES:
COc1cccc2[nH]c(cc12)C(=O)N[C@@H](CC(C)C)C(=O)N[C@@H](C[C@@H]1CCNC1=O)C(=O)COC(=O)c1cnn(C)c1C
: