Target
Replicase polyprotein 1ab
Ligand
BDBM496902
Substrate
Meas. Tech.
Antiviral activity from SARS-CoV-2 infection
EC50
75±n/a nM
Citation
 Owen, DRPettersson, MYReese, MRSammons, MFTuttle, JBVerhoest, PRWEI, LYANG, QYang, X Nitrile-containing antiviral compounds WIPO 0:0 (2021) Target
Name:
Replicase polyprotein 1ab
Synonyms:
ORF1ab polyprotein pp1ab | rep
Type:
Protein
Mol. Mass.:
794070.71
Organism:
2019-nCoV
Description:
P0DTD1
Residue:
7096
  
Inhibitor
Name:
BDBM496902
Synonyms:
CVD-0018409 US11351149, Example 13 US20230391736, Example PF-07321332 science.abl4784, 6
Type:
Small organic molecule
Emp. Form.:
C23H32F3N5O4
Mol. Mass.:
499.5265
SMILES:
CC(C)(C)[C@H](NC(=O)C(F)(F)F)C(=O)N1C[C@H]2[C@@H]([C@H]1C(=O)N[C@@H](C[C@@H]1CCNC1=O)C#N)C2(C)C
: