Target
Replicase polyprotein 1ab
Ligand
BDBM510067
Substrate
Meas. Tech.
SARS-CoV-2 Coronavirus 3C Protease FRET Assay
IC50
208±n/a nM
Citation
 Owen, DRPettersson, MYReese, MRSammons, MFTuttle, JBVerhoest, PRWEI, LYANG, QYang, X Nitrile-containing antiviral compounds WIPO 0:0 (2021) Target
Name:
Replicase polyprotein 1ab
Synonyms:
ORF1ab polyprotein pp1ab | rep
Type:
Protein
Mol. Mass.:
794070.71
Organism:
2019-nCoV
Description:
P0DTD1
Residue:
7096
  
Inhibitor
Name:
BDBM510067
Synonyms:
N-[(2S)-1-({(1 S)-1-Cyano-2-[(3S)-2-oxopyrrolidin-3- yl]ethyl}amino)-4-methyl-1-oxopentan-2-yl]-3,5-difluoro-4-methoxy-1H-indole-2- carboxamide (19) WO2021250648, Example 19
Type:
Small organic molecule
Emp. Form.:
C23H27F2N5O4
Mol. Mass.:
475.4884
SMILES:
COc1c(F)ccc2[nH]c(C(=O)N[C@@H](CC(C)C)C(=O)N[C@@H](C[C@@H]3CCNC3=O)C#N)c(F)c12
: