Target
Replicase polyprotein 1ab
Ligand
BDBM510068
Substrate
Meas. Tech.
Antiviral activity from SARS-CoV-2 infection
EC50
>333±n/a nM
Citation
 Owen, DRPettersson, MYReese, MRSammons, MFTuttle, JBVerhoest, PRWEI, LYANG, QYang, X Nitrile-containing antiviral compounds WIPO 0:0 (2021) Target
Name:
Replicase polyprotein 1ab
Synonyms:
ORF1ab polyprotein pp1ab | rep
Type:
Protein
Mol. Mass.:
794070.71
Organism:
2019-nCoV
Description:
P0DTD1
Residue:
7096
  
Inhibitor
Name:
BDBM510068
Synonyms:
N-[(2S)-1-({(1 S)-1-Cyano-2-[(3S)-2-oxopyrrolidin-3-yl]ethyl}amino)-4,4-dimethyl-1- oxopentan-2-yl]-7-fluoro-4-methoxy-1H-indole-2-carboxamide (20) WO2021250648, Example 20
Type:
Small organic molecule
Emp. Form.:
C24H30FN5O4
Mol. Mass.:
471.5245
SMILES:
COc1ccc(F)c2[nH]c(cc12)C(=O)N[C@@H](CC(C)(C)C)C(=O)N[C@@H](C[C@@H]1CCNC1=O)C#N
: