Target
Replicase polyprotein 1ab
Ligand
BDBM510095
Substrate
Meas. Tech.
Antiviral activity from SARS-CoV-2 infection
EC50
>3330±n/a nM
Citation
 Owen, DRPettersson, MYReese, MRSammons, MFTuttle, JBVerhoest, PRWEI, LYANG, QYang, X Nitrile-containing antiviral compounds WIPO 0:0 (2021) Target
Name:
Replicase polyprotein 1ab
Synonyms:
ORF1ab polyprotein pp1ab | rep
Type:
Protein
Mol. Mass.:
794070.71
Organism:
2019-nCoV
Description:
P0DTD1
Residue:
7096
  
Inhibitor
Name:
BDBM510095
Synonyms:
US11351149, Example 47 | WO2021250648, Example 47
Type:
Small organic molecule
Emp. Form.:
C26H26F9N5O4
Mol. Mass.:
643.5014
SMILES:
COc1cc(c(c2[nH]c(C(=O)N[C@@H](CC(C)C)C(=O)N[C@@H](C[C@@H]3CCNC3=O)C#N)c(c12)C(F)(F)F)C(F)(F)F)C(F)(F)F
: