Target
Replicase polyprotein 1ab
Ligand
BDBM510110
Substrate
Meas. Tech.
SARS-CoV-2 Coronavirus 3C Protease FRET Assay
IC50
29±n/a nM
Citation
 Owen, DRPettersson, MYReese, MRSammons, MFTuttle, JBVerhoest, PRWEI, LYANG, QYang, X Nitrile-containing antiviral compounds WIPO 0:0 (2021) Target
Name:
Replicase polyprotein 1ab
Synonyms:
ORF1ab polyprotein pp1ab | rep
Type:
Protein
Mol. Mass.:
794070.71
Organism:
2019-nCoV
Description:
P0DTD1
Residue:
7096
  
Inhibitor
Name:
BDBM510110
Synonyms:
US11351149, Example 62 | WO2021250648, Example 62
Type:
Small organic molecule
Emp. Form.:
C24H31N5O4
Mol. Mass.:
453.534
SMILES:
COc1ccc(C)c2[nH]c(cc12)C(=O)N[C@@H](CC(C)C)C(=O)N[C@@H](C[C@@H]1CCNC1=O)C#N
: