Target
Replicase polyprotein 1ab
Ligand
BDBM510120
Substrate
Meas. Tech.
Antiviral activity from SARS-CoV-2 infection
EC50
1350±n/a nM
Citation
 Owen, DRPettersson, MYReese, MRSammons, MFTuttle, JBVerhoest, PRWEI, LYANG, QYang, X Nitrile-containing antiviral compounds WIPO 0:0 (2021) Target
Name:
Replicase polyprotein 1ab
Synonyms:
ORF1ab polyprotein pp1ab | rep
Type:
Protein
Mol. Mass.:
794070.71
Organism:
2019-nCoV
Description:
P0DTD1
Residue:
7096
  
Inhibitor
Name:
BDBM510120
Synonyms:
US11351149, Example 72 | WO2021250648, Example 72
Type:
Small organic molecule
Emp. Form.:
C20H29BrN6O3
Mol. Mass.:
481.387
SMILES:
CCn1nc(C)c(Br)c1C(=O)N[C@@H](CC(C)C)C(=O)N[C@@H](C[C@@H]1CCNC1=O)C#N
: