Target
Replicase polyprotein 1ab
Ligand
BDBM510123
Substrate
Meas. Tech.
SARS-CoV-2 Coronavirus 3C Protease FRET Assay
IC50
17±n/a nM
Citation
 Owen, DRPettersson, MYReese, MRSammons, MFTuttle, JBVerhoest, PRWEI, LYANG, QYang, X Nitrile-containing antiviral compounds WIPO 0:0 (2021) Target
Name:
Replicase polyprotein 1ab
Synonyms:
ORF1ab polyprotein pp1ab | rep
Type:
Protein
Mol. Mass.:
794070.71
Organism:
2019-nCoV
Description:
P0DTD1
Residue:
7096
  
Inhibitor
Name:
BDBM510123
Synonyms:
(2S,4R)-4-tert-Butyl-N-{(1S)-1-cyano-2-[(3S)-2-oxopyrrolidin-3-yl]ethyl}-1-{N- [(trifluoromethyl)sulfonyl]-L-valyl}piperidine-2-carboxamide [75 (DIAST-1)] WO2021250648, Example 76
Type:
Small organic molecule
Emp. Form.:
C23H36F3N5O5S
Mol. Mass.:
551.623
SMILES:
CC(C)[C@H](NS(=O)(=O)C(F)(F)F)C(=O)N1CC[C@H](C[C@@H]1C(=O)N[C@@H](C[C@@H]1CCNC1=O)C#N)C(C)(C)C
: