Target
Replicase polyprotein 1ab
Ligand
BDBM510126
Substrate
Meas. Tech.
Antiviral activity from SARS-CoV-2 infection
EC50
2740±n/a nM
Citation
 Owen, DRPettersson, MYReese, MRSammons, MFTuttle, JBVerhoest, PRWEI, LYANG, QYang, X Nitrile-containing antiviral compounds WIPO 0:0 (2021) Target
Name:
Replicase polyprotein 1ab
Synonyms:
ORF1ab polyprotein pp1ab | rep
Type:
Protein
Mol. Mass.:
794070.71
Organism:
2019-nCoV
Description:
P0DTD1
Residue:
7096
  
Inhibitor
Name:
BDBM510126
Synonyms:
(1R,2S,5S)-N-{(1 S)-1-Cyano-2-[(3S)-2-oxopyrrolidin-3-yl]ethyl}-6,6-di ethyl-3-[3- ethyl-N-(methylcarbamoyl)-L-valyl]-3-azabicyclo[3.1 0]hexane-2-carboxamide (78) WO2021250648, Example 78
Type:
Small organic molecule
Emp. Form.:
C23H36N6O4
Mol. Mass.:
460.5697
SMILES:
CNC(=O)N[C@H](C(=O)N1C[C@H]2[C@@H]([C@H]1C(=O)N[C@@H](C[C@@H]1CCNC1=O)C#N)C2(C)C)C(C)(C)C
: