Target
Replicase polyprotein 1ab
Ligand
BDBM510128
Substrate
Meas. Tech.
Antiviral activity from SARS-CoV-2 infection
EC50
158±n/a nM
Citation
 Owen, DRPettersson, MYReese, MRSammons, MFTuttle, JBVerhoest, PRWEI, LYANG, QYang, X Nitrile-containing antiviral compounds WIPO 0:0 (2021) Target
Name:
Replicase polyprotein 1ab
Synonyms:
ORF1ab polyprotein pp1ab | rep
Type:
Protein
Mol. Mass.:
794070.71
Organism:
2019-nCoV
Description:
P0DTD1
Residue:
7096
  
Inhibitor
Name:
BDBM510128
Synonyms:
N-(Trifluoroacetyl)-L-valyl-(4R)-N-{(1S)-1-cyano-2-[(3S)-2-oxopyrrolidin-3-yl]ethyl}-4- (trifluoromethyl)-L-prolinamide (80) WO2021250648, Example 80
Type:
Small organic molecule
Emp. Form.:
C20H25F6N5O4
Mol. Mass.:
513.434
SMILES:
CC(C)[C@H](NC(=O)C(F)(F)F)C(=O)N1C[C@@H](C[C@H]1C(=O)N[C@@H](C[C@@H]1CCNC1=O)C#N)C(F)(F)F
: