Target
Replicase polyprotein 1ab
Ligand
BDBM510132
Substrate
Meas. Tech.
SARS-CoV-2 Coronavirus 3C Protease FRET Assay
IC50
3.00±n/a nM
Citation
 Owen, DRPettersson, MYReese, MRSammons, MFTuttle, JBVerhoest, PRWEI, LYANG, QYang, X Nitrile-containing antiviral compounds WIPO 0:0 (2021) Target
Name:
Replicase polyprotein 1ab
Synonyms:
ORF1ab polyprotein pp1ab | rep
Type:
Protein
Mol. Mass.:
794070.71
Organism:
2019-nCoV
Description:
P0DTD1
Residue:
7096
  
Inhibitor
Name:
BDBM510132
Synonyms:
(1R,2S,5S)-N-{(1 S)-1-Cyano-2-[(3S)-2- oxopyrrolidin-3-yl]ethyl}-3-[3-(hydroxymethyl)-N-(trifluoroacetyl)-L-valyl]-6,6-dimethyl-3- azabicyclo[3.1.0]hexane-2-carboxamide (84) WO2021250648, Example 84
Type:
Small organic molecule
Emp. Form.:
C23H32F3N5O5
Mol. Mass.:
515.5259
SMILES:
CC(C)(CO)[C@H](NC(=O)C(F)(F)F)C(=O)N1C[C@H]2[C@@H]([C@H]1C(=O)N[C@@H](C[C@@H]1CCNC1=O)C#N)C2(C)C
: