Target
Replicase polyprotein 1ab
Ligand
BDBM510134
Substrate
Meas. Tech.
Antiviral activity from SARS-CoV-2 infection
EC50
237±n/a nM
Citation
 Owen, DRPettersson, MYReese, MRSammons, MFTuttle, JBVerhoest, PRWEI, LYANG, QYang, X Nitrile-containing antiviral compounds WIPO 0:0 (2021) Target
Name:
Replicase polyprotein 1ab
Synonyms:
ORF1ab polyprotein pp1ab | rep
Type:
Protein
Mol. Mass.:
794070.71
Organism:
2019-nCoV
Description:
P0DTD1
Residue:
7096
  
Inhibitor
Name:
BDBM510134
Synonyms:
(1R,2S,5S)-N-{(1S)-1-Cyano-2-[(3S)-2-oxopyrrolidin-3-yl]ethyl}-6,6-dimethyl-3-[5,5,5- trifluoro-2-(2,2,2-trifluoroacetamido)pentanoyl]-3-azabicyclo[3.1.0]hexane-2- carboxamide (86) | WO2021250648, Example 86
Type:
Small organic molecule
Emp. Form.:
C22H27F6N5O4
Mol. Mass.:
539.4713
SMILES:
CC1(C)[C@H]2CN([C@@H]([C@@H]12)C(=O)N[C@@H](C[C@@H]1CCNC1=O)C#N)C(=O)[C@H](CCC(F)(F)F)NC(=O)C(F)(F)F
: