Target
Protein arginine N-methyltransferase 5
Ligand
BDBM435523
Substrate
Meas. Tech.
Biochemical Assay
IC50
0.850±n/a nM
Citation
 Lin, HLuengo, JShetty, RHawkins, M Selective inhibitors of protein arginine methlytransferase 5 (PRMT5) US Patent  US11078205 Publication Date 8/3/2021 
Target
Name:
Protein arginine N-methyltransferase 5
Synonyms:
72 kDa ICln-binding protein HRMT1L5 IBP72 Jak-binding protein 1 PRMT5/MEP50 complex Protein arginine methyltransferase 5 (PRMT5) SKB1 homolog Shk1 kinase-binding protein 1 homolog
Type:
Enzyme
Mol. Mass.:
72679.99
Organism:
Homo sapiens (Human)
Description:
O14744
Residue:
637
  
Inhibitor
Name:
BDBM435523
Synonyms:
(2R,3S,4R,5R)-5-(4-amino-5-fluoro-7H- pyrrolo[2,3-d]pyrimidin-7-yl)-2-(((2- aminoquinolin-7-yl)oxy)methyl)-3- methyltetrahydrofuran-3,4-diol US11078205, Example 6 | US11208416, Example 6
Type:
Small organic molecule
Emp. Form.:
C21H21FN6O4
Mol. Mass.:
440.4276
SMILES:
C[C@@]1(O)[C@@H](COc2ccc3ccc(N)nc3c2)O[C@H]([C@@H]1O)n1cc(F)c2c(N)ncnc12
: