Target
Replicase polyprotein 1ab
Ligand
BDBM512404
Substrate
Meas. Tech.
Various Assay
IC50
0.27±n/a nM
Citation
 Gao, KWang, RChen, JTepe, JJHuang, FWei, GW Perspectives on SARS-CoV-2 Main Protease Inhibitors. J Med Chem 64:16922-16955 (2021)  
Target
Name:
Replicase polyprotein 1ab
Synonyms:
ORF1ab polyprotein pp1ab | rep
Type:
Protein
Mol. Mass.:
794070.71
Organism:
2019-nCoV
Description:
P0DTD1
Residue:
7096
  
Inhibitor
Name:
BDBM512404
Synonyms:
acs.jmedchem.1c00409_ST.1
Type:
Small Organic Molecule
Emp. Form.:
C24H32N4O6
Mol. Mass.:
472.5341
SMILES:
COc1cccc2[nH]c(cc12)C(=O)NC(CC(C)C)C(=O)NC(CC1CCNC1=O)C(=O)CO
: