Target
Replicase polyprotein 1ab
Ligand
BDBM59243
Substrate
Meas. Tech.
Various Assay
Ki
12±n/a nM
Citation
 Gao, KWang, RChen, JTepe, JJHuang, FWei, GW Perspectives on SARS-CoV-2 Main Protease Inhibitors. J Med Chem 64:16922-16955 (2021)  
Target
Name:
Replicase polyprotein 1ab
Synonyms:
3C-like proteinase 3C-like proteinase (SARS-CoV 3Cpro) 3CLp GFL Guanine-N7 methyltransferase Helicase Leader protein Non-structural protein 10 Non-structural protein 3 Non-structural protein 6 Non-structural protein 8 ORF1ab polyprotein PL2-PRO Pol R1AB_SARS RdRp SARS coronavirus main proteinase nsp1 nsp12 nsp14 nsp16 nsp3 nsp5 nsp7 nsp9 pp1ab | rep
Type:
Protein
Mol. Mass.:
790250.81
Organism:
Human SARS coronavirus (SARS-CoV) (Severe acute respiratory syndrome coronavirus)
Description:
P0C6X7
Residue:
7073
  
Inhibitor
Name:
BDBM59243
Synonyms:
Benzotriazole ester, 9 | acs.jmedchem.1c00409_ST.10
Type:
Small organic molecule
Emp. Form.:
C15H10N4O2
Mol. Mass.:
278.2655
SMILES:
O=C(On1nnc2ccccc12)c1cc2ccccc2[nH]1
: