Target
Replicase polyprotein 1ab
Ligand
BDBM512468
Substrate
Meas. Tech.
In vitro assay (SARS-CoV-2 M proenzymatic assay)
IC50
480±n/a nM
Citation
 Zavoronkovs, AIVANENKOV, YAZAGRIBELNYY, B Sars-cov-2 inhibitors having covalent modifications for treating coronavirus infections WIPO 0:0 (2021) Target
Name:
Replicase polyprotein 1ab
Synonyms:
ORF1ab polyprotein pp1ab | rep
Type:
Protein
Mol. Mass.:
794070.71
Organism:
2019-nCoV
Description:
P0DTD1
Residue:
7096
  
Inhibitor
Name:
BDBM512468
Synonyms:
WO2021219089, INSCoV-501R
Type:
Small organic molecule
Emp. Form.:
C25H27ClN6O5S
Mol. Mass.:
559.037
SMILES:
ClCC(=O)N([C@H](C(=O)NC1CCN(CC1)S(=O)(=O)C1CC1)c1cnccn1)c1ccc(cc1)-c1cnco1
: