Target
Replicase polyprotein 1ab
Ligand
BDBM512617
Substrate
Meas. Tech.
In vitro assay (SARS-CoV-2 M proenzymatic assay)
IC50
420±n/a nM
Citation
 Zavoronkovs, AIVANENKOV, YAZAGRIBELNYY, B Sars-cov-2 inhibitors having covalent modifications for treating coronavirus infections WIPO 0:0 (2021) Target
Name:
Replicase polyprotein 1ab
Synonyms:
ORF1ab polyprotein pp1ab | rep
Type:
Protein
Mol. Mass.:
794070.71
Organism:
2019-nCoV
Description:
P0DTD1
Residue:
7096
  
Inhibitor
Name:
BDBM512617
Synonyms:
WO2021219089, INSCoV-537
Type:
Small organic molecule
Emp. Form.:
C24H31ClN4O2
Mol. Mass.:
442.982
SMILES:
CC(C)(C)c1ccc(cc1)N(C(C(=O)NC1CCCCC1)c1ccnnc1)C(=O)CCl
: