Target
Replicase polyprotein 1ab
Ligand
BDBM512710
Substrate
Meas. Tech.
In vitro assay (SARS-CoV-2 M proenzymatic assay)
IC50
4970±n/a nM
Citation
 Zavoronkovs, AIVANENKOV, YAZAGRIBELNYY, B Sars-cov-2 inhibitors having covalent modifications for treating coronavirus infections WIPO 0:0 (2021) Target
Name:
Replicase polyprotein 1ab
Synonyms:
ORF1ab polyprotein pp1ab | rep
Type:
Protein
Mol. Mass.:
794070.71
Organism:
2019-nCoV
Description:
P0DTD1
Residue:
7096
  
Inhibitor
Name:
BDBM512710
Synonyms:
WO2021219089, INSCoV-574A
Type:
Small organic molecule
Emp. Form.:
C23H25ClF3N3O2
Mol. Mass.:
467.912
SMILES:
FC(F)(F)c1ccccc1CN(C(C(=O)NC1CCCCC1)c1cccnc1)C(=O)CCl
: