Target
Replicase polyprotein 1ab
Ligand
BDBM512726
Substrate
Meas. Tech.
In vitro assay (SARS-CoV-2 M proenzymatic assay)
IC50
430±n/a nM
Citation
 Zavoronkovs, AIVANENKOV, YAZAGRIBELNYY, B Sars-cov-2 inhibitors having covalent modifications for treating coronavirus infections WIPO 0:0 (2021) Target
Name:
Replicase polyprotein 1ab
Synonyms:
ORF1ab polyprotein pp1ab | rep
Type:
Protein
Mol. Mass.:
794070.71
Organism:
2019-nCoV
Description:
P0DTD1
Residue:
7096
  
Inhibitor
Name:
BDBM512726
Synonyms:
WO2021219089, INCoV-600A (2)
Type:
Small organic molecule
Emp. Form.:
C22H22ClN5O4
Mol. Mass.:
455.894
SMILES:
ClCC(=O)N(C(C(=O)NC1CCOCC1)c1cncnc1)c1ccc(cc1)-c1cnco1
: