Target
Replicase polyprotein 1ab
Ligand
BDBM512765
Substrate
Meas. Tech.
In vitro assay (SARS-CoV-2 M proenzymatic assay)
IC50
530±n/a nM
Citation
 Zavoronkovs, AIVANENKOV, YAZAGRIBELNYY, B Sars-cov-2 inhibitors having covalent modifications for treating coronavirus infections WIPO 0:0 (2021) Target
Name:
Replicase polyprotein 1ab
Synonyms:
ORF1ab polyprotein pp1ab | rep
Type:
Protein
Mol. Mass.:
794070.71
Organism:
2019-nCoV
Description:
P0DTD1
Residue:
7096
  
Inhibitor
Name:
BDBM512765
Synonyms:
WO2021219089, INCoV-600F
Type:
Small organic molecule
Emp. Form.:
C24H22ClF2N5O3
Mol. Mass.:
501.913
SMILES:
FC1(F)CC2(CC(C2)NC(=O)C(N(C(=O)CCl)c2ccc(cc2)-c2cnco2)c2cncnc2)C1
: