Target
Replicase polyprotein 1ab
Ligand
BDBM512869
Substrate
Meas. Tech.
In vitro assay (SARS-CoV-2 M proenzymatic assay)
IC50
380±n/a nM
Citation
 Zavoronkovs, AIVANENKOV, YAZAGRIBELNYY, B Sars-cov-2 inhibitors having covalent modifications for treating coronavirus infections WIPO 0:0 (2021) Target
Name:
Replicase polyprotein 1ab
Synonyms:
ORF1ab polyprotein pp1ab | rep
Type:
Protein
Mol. Mass.:
794070.71
Organism:
2019-nCoV
Description:
P0DTD1
Residue:
7096
  
Inhibitor
Name:
BDBM512869
Synonyms:
WO2021219089, INSCoV-601P
Type:
Small organic molecule
Emp. Form.:
C24H24ClF2N5O3
Mol. Mass.:
503.929
SMILES:
CC(N(C(=O)CCl)c1ccc(cc1)-c1ccno1)(C(=O)NC1CCC(F)(F)CC1)c1cncnc1
: