Target
Replicase polyprotein 1ab
Ligand
BDBM512910
Substrate
Meas. Tech.
In vitro assay (SARS-CoV-2 M proenzymatic assay)
IC50
>25000±n/a nM
Citation
 Zavoronkovs, AIVANENKOV, YAZAGRIBELNYY, B Sars-cov-2 inhibitors having covalent modifications for treating coronavirus infections WIPO 0:0 (2021) Target
Name:
Replicase polyprotein 1ab
Synonyms:
ORF1ab polyprotein pp1ab | rep
Type:
Protein
Mol. Mass.:
794070.71
Organism:
2019-nCoV
Description:
P0DTD1
Residue:
7096
  
Inhibitor
Name:
BDBM512910
Synonyms:
WO2021219089, INSCoV-618
Type:
Small organic molecule
Emp. Form.:
C24H23F2N5O2S
Mol. Mass.:
483.534
SMILES:
FC1(F)CCC(CC1)NC(=O)C(N(C(=O)C=C)c1ccc(cc1)-c1cncs1)c1cncnc1
: