Target
Steroid 17-alpha-hydroxylase/17,20 lyase
Ligand
BDBM144629
Substrate
Meas. Tech.
SPA Assay
IC50
611±n/a nM
Citation
 Balog, JAHuang, A Substituted bicyclic heteroaryl compounds US Patent  US9598436 Publication Date 3/21/2017 
Target
Name:
Steroid 17-alpha-hydroxylase/17,20 lyase
Synonyms:
CP17A_HUMAN CYP17A1 Cytochrome P450 17A1 Cytochrome P450 C17 (CYP17) Cytochrome P450-C17 P450-C17 Steroid 17-alpha-Monooxygenase (CYP17) Steroid 17-alpha-monooxygenase | cytochrome P450 monooxygenase 17 alpha hydroxylase/17,20-lyase (CYP17)
Type:
Enzyme
Mol. Mass.:
57382.42
Organism:
Homo sapiens (Human)
Description:
E.coli expressing human CYP17
Residue:
508
  
Inhibitor
Name:
BDBM144629
Synonyms:
US8969586, 124 | US9598436, 124
Type:
Small organic molecule
Emp. Form.:
C24H18N2O2
Mol. Mass.:
366.4119
SMILES:
Cc1ccncc1-c1cccc2c(OCc3ccc4ccccc4c3)noc12
: