Target
Replicase polyprotein 1ab
Ligand
BDBM513874
Substrate
Meas. Tech.
Cellular Antiviral Activity
EC50
1400±n/a nM
Citation
 Unoh, YUehara, SNakahara, KNobori, HYamatsu, YYamamoto, SMaruyama, YTaoda, YKasamatsu, KSuto, TKouki, KNakahashi, AKawashima, SSanaki, TToba, SUemura, KMizutare, TAndo, SSasaki, MOrba, YSawa, HSato, ASato, TKato, TTachibana, Y Discovery of S-217622, a Non-Covalent Oral SARS-CoV-2 3CL Protease Inhibitor Clinical Candidate for Treating COVID-19 bioRxiv 2022:0 (2022)   
Target
Name:
Replicase polyprotein 1ab
Synonyms:
2.1.1.- 3.1.-.- 3.4.19.12 3.4.22.69 3.6.4.13 3CL-PRO ExoN Growth factor-like peptide Hel Host translation inhibitor nsp1 NendoU Non-structural protein 2 Non-structural protein 4 Non-structural protein 7 Non-structural protein 9 PL-PRO Pol RNA-directed RNA polymerase Replicase polyprotein 1ab nsp1 nsp12 nsp14 nsp16 nsp3 nsp5 nsp7 nsp9 pp1ab | rep
Type:
PROTEIN
Mol. Mass.:
789589.93
Organism:
Middle East respiratory syndrome-related coronavirus (isolate UnitedKingdom/H123990006/2012) (Betacoronavirus England 1) (Humancoronavirus EMC)
Description:
ChEMBL_117802
Residue:
7078
  
Inhibitor
Name:
BDBM513874
Synonyms:
bioRxiv20220126.477782, S-217622 | bioRxiv20220126.477782, Screening Hit 2
Type:
Small organic molecule
Emp. Form.:
C22H17ClF3N9O2
Mol. Mass.:
531.878
SMILES:
Cn1cnc(Cn2c(=O)[nH]\c(=N/c3cc4cn(C)nc4cc3Cl)n(Cc3cc(F)c(F)cc3F)c2=O)n1
: