Target
Cyclin-dependent kinase 2/G1/S-specific cyclin-E1
Ligand
BDBM8055
Substrate
Histone H1
Meas. Tech.
CDK Kinase Inhibition Assay
Temperature
303.15±n/a K
Ki
30±n/a nM
Comments
extracted
Citation
 Wang, SMeades, CWood, GOsnowski, AAnderson, SYuill, RThomas, MMezna, MJackson, WMidgley, CGriffiths, GFleming, IGreen, SMcNae, IWu, SYMcInnes, CZheleva, DWalkinshaw, MDFischer, PM 2-Anilino-4-(thiazol-5-yl)pyrimidine CDK inhibitors: synthesis, SAR analysis, X-ray crystallography, and biological activity. J Med Chem 47:1662-75 (2004)  
Target
Name:
Cyclin-dependent kinase 2/G1/S-specific cyclin-E1
Synonyms:
CDK2/CycE CDK2/E Cyclin-Dependent Kinase 2 (CDK2) Cyclin-dependent kinase 2/cyclin E1
Type:
Protein
Mol. Mass.:
Description:
Components:
This complex has 2 components.
Component 1
Name:
Cyclin-dependent kinase 2
Synonyms:
CDK2 CDK2_HUMAN Cell division protein kinase 2 Protein cereblon/Cyclin-dependent kinase 2 | p33 protein kinase
Type:
Enzyme Subunit
Mol. Mass.:
33938.17
Organism:
Homo sapiens (Human)
Description:
P24941
Residue:
298
  
Component 2
Name:
G1/S-specific cyclin-E1
Synonyms:
CCNE CCNE1_HUMAN
Type:
Enzyme Subunit
Mol. Mass.:
47073.17
Organism:
Homo sapiens (Human)
Description:
Residue:
410
  
Inhibitor
Name:
BDBM8055
Synonyms:
2-Anilino-4-(thiazol-5-yl)pyrimidine deriv. 26 4-[4-(2-Amino-4-methylthiazol-5-yl)pyrimidin-2-ylamino]phenol, 7 | 4-{[4-(2-amino-4-methyl-1,3-thiazol-5-yl)pyrimidin-2-yl]amino}phenol
Type:
Small organic molecule
Emp. Form.:
C14H13N5OS
Mol. Mass.:
299.351
SMILES:
Cc1nc(N)sc1-c1ccnc(Nc2ccc(O)cc2)n1
:
Substrate
Name:
Histone H1
Synonyms:
Type:
Other Protein Type
Mol. Mass.:
358.43
Organism:
Bos taurus (bovine)
Description:
Residue:
3
NA