Target
Interleukin-1 receptor-associated kinase 4
Ligand
BDBM302996
Substrate
Meas. Tech.
Kinase Activity Assay
IC50
0.200±n/a nM
Citation
 Seganish, WMMcElroy, WTBrumfield, SHerr, RJYet, LYang, JHarding, III, JPHo, GDTulshian, DYu, WWong, MKLavey, BKozlowski, JA Inhibitors of IRAK4 activity US Patent  US9598440 Publication Date 3/21/2017 
Target
Name:
Interleukin-1 receptor-associated kinase 4
Synonyms:
IRAK-4 IRAK4_HUMAN Interleukin-1 receptor-associated kinase 4 (IRAK4) | Renal carcinoma antigen NY-REN-64
Type:
Protein
Mol. Mass.:
51519.08
Organism:
Homo sapiens (Human)
Description:
Q9NWZ3
Residue:
460
  
Inhibitor
Name:
BDBM302996
Synonyms:
US9598440, 137
Type:
Small organic molecule
Emp. Form.:
C25H30N7O3S
Mol. Mass.:
508.615
SMILES:
Cc1cc(Nc2ncc(-c3nc4cnccc4s3)c(N[C@@H]3C[C@@H]([C@@H](O)[C@H]3O)C(C)(C)O)[nH+]2)cc(C)n1
: