Target
Toll-like receptor 8
Ligand
BDBM427822
Substrate
Meas. Tech.
TLR7/8/9 Inhibition Reporter Assays
IC50
0.250±n/a nM
Citation
 Dyckman, AJDodd, DSMussari, CPSherwood, TCWhiteley, BKGilmore, JLKumar, SRPasunoori, LSrinivas, PVDuraisamy, SKHegde, SAnumula, RK 4-azaindole compounds US Patent  US11053244 Publication Date 7/6/2021 
Target
Name:
Toll-like receptor 8
Synonyms:
CD_antigen: CD288 TLR8_HUMAN | TRL8
Type:
Enzyme
Mol. Mass.:
119828.77
Organism:
Homo sapiens (Human)
Description:
Q9NR97
Residue:
1041
  
Inhibitor
Name:
BDBM427822
Synonyms:
US10544143, Example 255 US10730877, Example 256 | US11053244, Example 256
Type:
Small organic molecule
Emp. Form.:
C29H35N5O2S
Mol. Mass.:
517.686
SMILES:
CC(C)c1c([nH]c2ccc(nc12)C1CCC(CC1)N1CC2(C1)CS(=O)(=O)C2)-c1cn(C)c2ncccc12
: