Target
Mitogen-activated protein kinase kinase kinase kinase 1
Ligand
BDBM519597
Substrate
Meas. Tech.
HPK1 Biochemical Enzyme Assay
Ki
<0.080±n/a nM
Citation
 Gallego, RANair, SKKania, RSAhmad, OKJohnson, TWTuttle, JBJalaie, MMcTigue, MAZhou, DDel Bel, MLZhou, RHe, MSchmitt, AD Azalactam compounds as HPK1 inhibitors US Patent  US11142525 Publication Date 10/12/2021 
Target
Name:
Mitogen-activated protein kinase kinase kinase kinase 1
Synonyms:
HPK1 MAP4K1
Type:
PROTEIN
Mol. Mass.:
91316.07
Organism:
Homo sapiens (Human)
Description:
ChEMBL_586597
Residue:
833
  
Inhibitor
Name:
BDBM519597
Synonyms:
US11142525, Example 13
Type:
Small organic molecule
Emp. Form.:
C21H23F3N8O
Mol. Mass.:
460.4555
SMILES:
C[C@@H](CC(F)(F)F)n1cnnc1-c1cccc(n1)N1Cc2c(cc(nc2CN)N(C)C)C1=O
: