Target
Adenosine receptor A2a
Ligand
BDBM50139769
Substrate
Meas. Tech.
A2a Ki assay
Ki
86.0±n/a nM
Citation
 Ali, AKuang, RLim, YLo, MMTing, PCBiju, Pde Lera Ruiz, MDegrado, SJTung, ALHenderson, TJHong, LKim, JKim, DWLee, JWu, JWu, HXiao, YYu, TZhou, GZhu, XMcCormick, KDTagat, JRXiao, DKhan, TCao, JBerlin, MZhang, Y Aminoquinazoline compounds as A2A antagonist US Patent  US10138212 Publication Date 11/27/2018 
Target
Name:
Adenosine receptor A2a
Synonyms:
A2A adenosine receptor (hA2A) ADENOSINE A2 ADORA2 Adenosine A2A receptor (A2AAR)
Type:
G Protein-Coupled Receptor (GPCR)
Mol. Mass.:
44716.46
Organism:
Homo sapiens (Human)
Description:
P29274
Residue:
412
  
Inhibitor
Name:
BDBM50139769
Synonyms:
CHEMBL3764006 | US10138212, Example 95
Type:
Small organic molecule
Emp. Form.:
C20H17N5O3S
Mol. Mass.:
407.446
SMILES:
CS(=O)(=O)c1cccc2c(nc(N)nc12)C(=O)NCc1cccc2cccnc12
: