Target
Dimer of Gag-Pol polyprotein [501-599,Q508K,L534I,L564I,C568A,C596A,L591M]
Ligand
BDBM8125
Substrate
HIV Peptide Substrate
Meas. Tech.
Protease Inhibition Assay
Ki
0.03±n/a nM
Citation
 Kovalevsky, AYTie, YLiu, FBoross, PIWang, YFLeshchenko, SGhosh, AKHarrison, RWWeber, IT Effectiveness of nonpeptide clinical inhibitor TMC-114 on HIV-1 protease with highly drug resistant mutations D30N, I50V, and L90M. J Med Chem 49:1379-87 (2006)  
Target
Name:
Dimer of Gag-Pol polyprotein [501-599,Q508K,L534I,L564I,C568A,C596A,L591M]
Synonyms:
HIV-1 Protease Mutant (L90M)
Type:
Protein Complex
Mol. Mass.:
Description:
Components:
This complex has 2 components.
Component 1
Name:
Gag-Pol polyprotein [501-599,Q508K,L534I,L564I,C568A,C596A,L591M]
Synonyms:
HIV-1 Protease Mutant (L90M) chain A POL_HV1BR | gag-pol
Type:
Enzyme Subunit
Mol. Mass.:
10750.15
Organism:
Human immunodeficiency virus type 1
Description:
All of the mutant constructs in this study are on the wild type containing the substitutions Q7K, L33I, and L63I, to minimize the autoproteolysis of the protease, and C67A and C95A, to prevent cysteine-thiol oxidation.
Residue:
99
  
Component 2
Name:
Gag-Pol polyprotein [501-599,Q508K,L534I,L564I,C568A,C596A,L591M]
Synonyms:
HIV-1 Protease Mutant (L90M) chain A POL_HV1BR | gag-pol
Type:
Enzyme Subunit
Mol. Mass.:
10750.15
Organism:
Human immunodeficiency virus type 1
Description:
All of the mutant constructs in this study are on the wild type containing the substitutions Q7K, L33I, and L63I, to minimize the autoproteolysis of the protease, and C67A and C95A, to prevent cysteine-thiol oxidation.
Residue:
99
  
Inhibitor
Name:
BDBM8125
Synonyms:
(3R,3aS,6aR)-hexahydrofuro[2,3-b]furan-3-yl N-[(2S,3R)-4-[(4-aminobenzene)(2-methylpropyl)sulfonamido]-3-hydroxy-1-phenylbutan-2-yl]carbamate Darunavir TMC-114 US10806794, Compound Darunavir
Type:
Small organic molecule
Emp. Form.:
C27H37N3O7S
Mol. Mass.:
547.664
SMILES:
[H][C@@]1(CO[C@@]2([H])OCC[C@@]12[H])OC(=O)N[C@@H](Cc1ccccc1)[C@H](O)CN(CC(C)C)S(=O)(=O)c1ccc(N)cc1
:
Substrate
Name:
HIV Peptide Substrate
Synonyms:
Type:
Peptide
Mol. Mass.:
3156.95
Organism:
Description:
Residue:
27