Target
Glycogen synthase kinase-3 beta
Ligand
BDBM8135
Substrate
Biotinylated Peptide Substrate
Meas. Tech.
Kinase Inhibition SPA Assay
Ki
2±n/a nM
IC50
<10±n/a nM
Citation
 Tavares, FXBoucheron, JADickerson, SHGriffin, RJPreugschat, FThomson, SAWang, TYZhou, HQ N-Phenyl-4-pyrazolo[1,5-b]pyridazin-3-ylpyrimidin-2-amines as potent and selective inhibitors of glycogen synthase kinase 3 with good cellular efficacy. J Med Chem 47:4716-30 (2004)  
Target
Name:
Glycogen synthase kinase-3 beta
Synonyms:
GSK-3 beta GSK3B Glycogen synthase kinase 3 beta (GSK3B) Glycogen synthase kinase-3 beta (GSK-3B) Glycogen synthase kinase-3 beta (GSK3B) Glycogen synthase kinase-3beta (GSK3B) | Serine/threonine-protein kinase GSK3B
Type:
Enzyme
Mol. Mass.:
46756.38
Organism:
Homo sapiens (Human)
Description:
P49841
Residue:
420
  
Inhibitor
Name:
BDBM8135
Synonyms:
N-(2H-1,3-benzodioxol-5-yl)-4-{pyrazolo[1,5-a]pyridazin-3-yl}pyrimidin-2-amine | pyrazolo[1,5-b]pyridazine deriv. 26
Type:
Small organic molecule
Emp. Form.:
C17H12N6O2
Mol. Mass.:
332.3162
SMILES:
C1Oc2ccc(Nc3nccc(n3)-c3cnn4ncccc34)cc2O1
:
Substrate
Name:
Biotinylated Peptide Substrate
Synonyms:
Type:
Peptide
Mol. Mass.:
6828.27
Organism:
Description:
Residue:
63