Target
Replicase polyprotein 1ab
Ligand
BDBM525162
Substrate
Meas. Tech.
SARS-CoV-2 3CLPpro inhibition assay
IC50
1200±n/a nM
Citation
 Chen, JLiang, CMIAO, KWu, YYun, HZhang, W Aminocarbamoyl compounds for the treatment of viral infections WIPO 0:0 (2022) Target
Name:
Replicase polyprotein 1ab
Synonyms:
ORF1ab polyprotein pp1ab | rep
Type:
Protein
Mol. Mass.:
794070.71
Organism:
2019-nCoV
Description:
P0DTD1
Residue:
7096
  
Inhibitor
Name:
BDBM525162
Synonyms:
Benzyl N-[(1S)-2-[2-(3-amino-3-oxo-propyl)-2-(2-fluoroacetyl)hydrazino]-1-(cyclohexylmethyl)-2-oxo-ethyl]carbamate | WO2022043374, Example 15
Type:
Small organic molecule
Emp. Form.:
C22H31FN4O5
Mol. Mass.:
450.5037
SMILES:
NC(=O)CCN(NC(=O)[C@H](CC1CCCCC1)NC(=O)OCc1ccccc1)C(=O)CF
: