Target
Replicase polyprotein 1ab
Ligand
BDBM525201
Substrate
Meas. Tech.
SARS-CoV-2 3CLPpro inhibition assay
IC50
74±n/a nM
Citation
 Chen, JLiang, CMIAO, KWu, YYun, HZhang, W Aminocarbamoyl compounds for the treatment of viral infections WIPO 0:0 (2022) Target
Name:
Replicase polyprotein 1ab
Synonyms:
ORF1ab polyprotein pp1ab | rep
Type:
Protein
Mol. Mass.:
794070.71
Organism:
2019-nCoV
Description:
P0DTD1
Residue:
7096
  
Inhibitor
Name:
BDBM525201
Synonyms:
N-[(1S)-1-[[(2-Chloroacetyl)-[3-(methylamino)-3-oxo-propyl]amino]carbamoyl]-3-methyl-butyl]-N-methyl-1H-indole-2-carboxamide | WO2022043374, Example 50
Type:
Small organic molecule
Emp. Form.:
C22H30ClN5O4
Mol. Mass.:
463.958
SMILES:
CNC(=O)CCN(NC(=O)[C@H](CC(C)C)N(C)C(=O)c1cc2ccccc2[nH]1)C(=O)CCl
: