Target
Replicase polyprotein 1ab
Ligand
BDBM525218
Substrate
Meas. Tech.
SARS-CoV-2 3CLPpro inhibition assay
IC50
8.00±n/a nM
Citation
 Chen, JLiang, CMIAO, KWu, YYun, HZhang, W Aminocarbamoyl compounds for the treatment of viral infections WIPO 0:0 (2022) Target
Name:
Replicase polyprotein 1ab
Synonyms:
ORF1ab polyprotein pp1ab | rep
Type:
Protein
Mol. Mass.:
794070.71
Organism:
2019-nCoV
Description:
P0DTD1
Residue:
7096
  
Inhibitor
Name:
BDBM525218
Synonyms:
WO2022043374, Example 60-A
Type:
Small organic molecule
Emp. Form.:
C19H23Cl2FN6O4
Mol. Mass.:
489.328
SMILES:
CC(C)C[C@H](NC(=O)c1nc2cc(Cl)ccc2[nH]1)C(=O)NN(CCC(N)=O)C(=O)[C@@H](F)Cl
: